Target
Sodium/calcium exchanger 1
Ligand
BDBM140685
Substrate
Meas. Tech.
Reverse Mode Assay
IC50
200±n/a nM
Citation
 Czechtizky, WWeston, JRackelmann, NPodeschwa, MArndt, PWirth, KGoegelein, HRitzeler, OKraft, VBellevergue, PMcCort, G Substituted 2-(chroman-6-yloxy)-thiazoles and their use as pharmaceuticals US Patent  US8912224 Publication Date 12/16/2014 
Target
Name:
Sodium/calcium exchanger 1
Synonyms:
CNC NCX1 Sodium/calcium exchanger 1(NCX1)
Type:
Protein
Mol. Mass.:
108507.88
Organism:
Homo sapiens (Human)
Description:
P32418
Residue:
973
  
Inhibitor
Name:
BDBM140685
Synonyms:
US8912224, 116
Type:
Small organic molecule
Emp. Form.:
C22H24N2O2S
Mol. Mass.:
380.503
SMILES:
CC(CN)Cc1cnc(Oc2ccc3OC(CCc3c2)c2ccccc2)s1
: