Target
Muscarinic acetylcholine receptor M3
Ligand
BDBM103738
Substrate
Meas. Tech.
Radioligand Binding Assay
Ki
0.10±n/a nM
Citation
 Hughes, ADByun, DChen, YFleury, MJacobsen, JRStangeland, ELWilson, RDYen, R Diamide compounds having muscarinic receptor antagonist and β2 adrenergic receptor agonist activity US Patent  US9682957 Publication Date 6/20/2017 
Target
Name:
Muscarinic acetylcholine receptor M3
Synonyms:
ACM3_HUMAN Cholinergic, muscarinic M3 Muscarinic receptor M3 | RecName: Full=Muscarinic acetylcholine receptor M3
Type:
Enzyme
Mol. Mass.:
66151.03
Organism:
Homo sapiens (Human)
Description:
P20309
Residue:
590
  
Inhibitor
Name:
BDBM103738
Synonyms:
US8551978, I-2 US9394275, I-2 US9682957, I-2
Type:
Small organic molecule
Emp. Form.:
C45H52N6O7
Mol. Mass.:
788.9304
SMILES:
CN(CCCC(=O)Nc1ccc(CNC[C@H](O)c2ccc(O)c3[nH]c(=O)ccc23)cc1C)C(=O)CCN1CCC(CC1)OC(=O)Nc1ccccc1-c1ccccc1
: