Target
Muscarinic acetylcholine receptor M3
Ligand
BDBM103747
Substrate
Meas. Tech.
Radioligand Binding Assay
Ki
0.10±n/a nM
Citation
 Hughes, ADByun, DChen, YFleury, MJacobsen, JRStangeland, ELWilson, RDYen, R Diamide compounds having muscarinic receptor antagonist and β2 adrenergic receptor agonist activity US Patent  US9682957 Publication Date 6/20/2017 
Target
Name:
Muscarinic acetylcholine receptor M3
Synonyms:
ACM3_HUMAN Cholinergic, muscarinic M3 Muscarinic receptor M3 | RecName: Full=Muscarinic acetylcholine receptor M3
Type:
Enzyme
Mol. Mass.:
66151.03
Organism:
Homo sapiens (Human)
Description:
P20309
Residue:
590
  
Inhibitor
Name:
BDBM103747
Synonyms:
US8551978, I-12 US9394275, I-12 US9682957, I-12
Type:
Small organic molecule
Emp. Form.:
C47H56N6O7
Mol. Mass.:
816.9835
SMILES:
C[C@H](Cc1cccc(CC(=O)NCCCN(C)C(=O)CCN2CCC(CC2)OC(=O)Nc2ccccc2-c2ccccc2)c1)NC[C@H](O)c1ccc(O)c2[nH]c(=O)ccc12
: