Target
Kappa-type opioid receptor
Ligand
BDBM285850
Substrate
Meas. Tech.
Radioligand Competition Binding Assay
pH
7.5±n/a
IC50
12820±n/a nM
Comments
extracted
Citation
 Duarte, FJAnand, NKSharma, PSingh, D Opioid agonists and uses thereof US Patent  US10081602 Publication Date 9/25/2018 
Target
Name:
Kappa-type opioid receptor
Synonyms:
K-OR-1 Kappa-opioid receptor (KOR) Kappa-type opioid receptor (KOR) OPIATE Kappa OPRK1 kappa opioid receptor (KOR)
Type:
G Protein-Coupled Receptor (GPCR)
Mol. Mass.:
42648.76
Organism:
Homo sapiens (Human)
Description:
P41145
Residue:
380
  
Inhibitor
Name:
BDBM285850
Synonyms:
(2S,6R,11R)-3-(Cyclopropylmethyl)-6,11-dimethyl-8-(2,5,8,11,14-pentaoxahexadecan-16-ylamino)-3,4,5,6-tetrahydro-2,6-methano-3-benzazocin-1(2H)-One (5) | US10081602, Example 5
Type:
Small organic molecule
Emp. Form.:
C30H47NO7
Mol. Mass.:
533.6967
SMILES:
COCCOCCOCCOCCOCCOc1ccc2C(=O)[C@@H]3[C@H](C)[C@](C)(CCCN3CC3CC3)c2c1
: