Target
Glucocorticoid receptor
Ligand
BDBM141378
Substrate
Meas. Tech.
Radioligand Binding Assay
pH
7.4±n/a
Temperature
298.15±n/a K
IC50
0.767±n/a nM
Comments
extracted
Citation
 Berger, MRehwinkel, HDahmén, JEriksson, AHansson, THossain, NKlingstedt, PTLepistö, MNilsson, SHemmerling, MEdman, K Phenyl and benzodioxinyl substituted indazoles derivatives US Patent  US8916600 Publication Date 12/23/2014 
Target
Name:
Glucocorticoid receptor
Synonyms:
GCR_HUMAN GRL Glucocorticoid receptor (GRFP) Nuclear receptor subfamily 3 group C member 1
Type:
Enzyme
Mol. Mass.:
85656.87
Organism:
Homo sapiens (Human)
Description:
P04150
Residue:
777
  
Inhibitor
Name:
BDBM141378
Synonyms:
US8916600, 12 | US9738632, Example 12
Type:
Small organic molecule
Emp. Form.:
C34H31F2N5O5
Mol. Mass.:
627.6372
SMILES:
C[C@H](NC(=O)C(C)(F)F)[C@H](Oc1ccc2n(ncc2c1)-c1cccc(c1)C(=O)NCc1cccnc1)c1ccc2OCCOc2c1
: