Target
EF-hand calcium-binding domain-containing protein 4B
Ligand
BDBM141393
Substrate
Meas. Tech.
In-Vitro Inhibition Assay
Temperature
310.15±n/a K
IC50
62.44±n/a nM
Comments
extracted
Citation
 Muthuppalaniappan, MViswanadha, SMerikapudi, GSVakkalanka, SK Modulators of calcium release-activated calcium channel US Patent  US8921364 Publication Date 12/30/2014 
Target
Name:
EF-hand calcium-binding domain-containing protein 4B
Synonyms:
CRACR2A EFC4B_HUMAN RAB46
Type:
Protein
Mol. Mass.:
45570.29
Organism:
Homo sapiens (Human)
Description:
Q9BSW2
Residue:
395
  
Inhibitor
Name:
BDBM141393
Synonyms:
US10668051, Compound Example 1 | US8921364, 1
Type:
Small organic molecule
Emp. Form.:
C19H19N5OS
Mol. Mass.:
365.452
SMILES:
Cc1nnsc1C(=O)Nc1ccc(cc1)-n1nc(cc1C1CC1)C1CC1
: