Target
EF-hand calcium-binding domain-containing protein 4B
Ligand
BDBM141433
Substrate
Meas. Tech.
In-Vitro Inhibition Assay
Temperature
310.15±n/a K
IC50
159.3±n/a nM
Comments
extracted
Citation
 Muthuppalaniappan, MViswanadha, SMerikapudi, GSVakkalanka, SK Modulators of calcium release-activated calcium channel US Patent  US8921364 Publication Date 12/30/2014 
Target
Name:
EF-hand calcium-binding domain-containing protein 4B
Synonyms:
CRACR2A EFC4B_HUMAN RAB46
Type:
Protein
Mol. Mass.:
45570.29
Organism:
Homo sapiens (Human)
Description:
Q9BSW2
Residue:
731
  
Inhibitor
Name:
BDBM141433
Synonyms:
US10668051, Compound Example 92 | US8921364, 92
Type:
Small organic molecule
Emp. Form.:
C19H12Cl2F4N4O
Mol. Mass.:
459.224
SMILES:
Fc1cc(NC(=O)c2c(Cl)cncc2Cl)ccc1-n1nc(cc1C1CC1)C(F)(F)F
: