Target
Tyrosine-protein kinase JAK3
Ligand
BDBM141480
Substrate
Meas. Tech.
Kinase Assay
pH
8±n/a
Temperature
298.15±n/a K
IC50
0.3±n/a nM
Comments
extracted
Citation
 Wrobleski, STBrown, GDDoweyko, LMDuan, JGuo, JHynes, JJiang, BKempson, JLin, SLu, ZSpergel, SHTokarski, JSWu, HYang, BV Pyrrolopyridazine JAK3 inhibitors and their use for the treatment of inflammatory and autoimmune diseases US Patent  US8921368 Publication Date 12/30/2014 
Target
Name:
Tyrosine-protein kinase JAK3
Synonyms:
JAK-3 JAK3_HUMAN Janus kinase 3 (JAK3) L-JAK | Leukocyte janus kinase
Type:
Protein
Mol. Mass.:
125111.08
Organism:
Homo sapiens (Human)
Description:
P52333
Residue:
1124
  
Inhibitor
Name:
BDBM141480
Synonyms:
US8921368, 271
Type:
Small organic molecule
Emp. Form.:
C23H29N5O2
Mol. Mass.:
407.5087
SMILES:
C[C@]1(N)CC[C@@H](Nc2c(cnn3cc(cc23)-c2ccc(CO)cc2)C(N)=O)C1(C)C
: