Target
Egl nine homolog 1
Ligand
BDBM141564
Substrate
Meas. Tech.
Enzyme Assay
pH
7.4±n/a
IC50
35000±n/a nM
Comments
extracted
Citation
 Ng, DArend, MPFlippin, LA Naphthyridine derivatives as inhibitors of hypoxia inducible factor (HIF) hydroxylase US Patent  US8921389 Publication Date 12/30/2014 
Target
Name:
Egl nine homolog 1
Synonyms:
C1orf12 EGLN1_HUMAN Hypoxia-inducible factor prolyl hydroxylase 2 (HIF-PH2) Prolyl hydroxylase domain-containing protein 2 (PHD2)
Type:
Protein
Mol. Mass.:
46035.59
Organism:
Homo sapiens (Human)
Description:
Q9GZT9
Residue:
426
  
Inhibitor
Name:
BDBM141564
Synonyms:
US8921389, 20 | US9695170 20
Type:
Small organic molecule
Emp. Form.:
C27H25N3O5
Mol. Mass.:
471.5045
SMILES:
Cc1nc(C(=O)NCCC(O)=O)c(O)c2cc(Cc3ccccc3)c(=O)n(Cc3ccccc3)c12
: