Target
Egl nine homolog 1
Ligand
BDBM141582
Substrate
Meas. Tech.
Enzyme Assay
pH
7.4±n/a
IC50
>200000±n/a nM
Comments
extracted
Citation
 Ng, DArend, MPFlippin, LA Naphthyridine derivatives as inhibitors of hypoxia inducible factor (HIF) hydroxylase US Patent  US8921389 Publication Date 12/30/2014 
Target
Name:
Egl nine homolog 1
Synonyms:
C1orf12 EGLN1_HUMAN Hypoxia-inducible factor prolyl hydroxylase 2 (HIF-PH2) Prolyl hydroxylase domain-containing protein 2 (PHD2)
Type:
Protein
Mol. Mass.:
46035.59
Organism:
Homo sapiens (Human)
Description:
Q9GZT9
Residue:
426
  
Inhibitor
Name:
BDBM141582
Synonyms:
US8921389, 38 | US9695170 38
Type:
Small organic molecule
Emp. Form.:
C18H14N4O3
Mol. Mass.:
334.3288
SMILES:
CNC(=O)c1nc(C#N)c2c(ccn(Cc3ccccc3)c2=O)c1O
: