Target
Nitric oxide synthase, inducible
Ligand
BDBM50366042
Substrate
Meas. Tech.
In Vitro Enzyme Assay
pH
7.4±n/a
Temperature
310.15±n/a K
Ki
114000±n/a nM
Comments
extracted
Citation
 Silverman, RBXue, F Intramolecular hydrogen-bonded nitric oxide synthase inhibitors US Patent  US8927730 Publication Date 1/6/2015 
Target
Name:
Nitric oxide synthase, inducible
Synonyms:
Inducible NO synthase Inducible nitric oxide synthase (iNOS) MAC-NOS NOS type II Nitric Oxide Synthase, inducible Nos2
Type:
Enzyme
Mol. Mass.:
130595.79
Organism:
Mus musculus (mouse)
Description:
Recombinant enzyme overexpressed in E. coli.
Residue:
1144
  
Inhibitor
Name:
BDBM50366042
Synonyms:
CHEMBL1956739 | US8927730, 3b
Type:
Small organic molecule
Emp. Form.:
C21H30N4O2
Mol. Mass.:
370.4885
SMILES:
COc1ccccc1CNCCO[C@@H]1CNC[C@@H]1Cc1cc(C)cc(N)n1
: