Target
Coagulation factor XI
Ligand
BDBM285859
Substrate
Meas. Tech.
Factor XIa Assay
pH
7.4±n/a
IC50
0.690±n/a nM
Comments
extracted
Citation
 Mertz, EEdmondson, SDSo, SSun, WLiu, WNeelamkavil, SFGao, YHruza, AZang, YAli, AMal, RHe, JKuang, RWu, HOgawa, AKNolting, AF Factor XIa inhibitors US Patent  US10081617 Publication Date 9/25/2018 
Target
Name:
Coagulation factor XI
Synonyms:
Coagulation factor XIa Coagulation factor XIa light chain FA11_HUMAN Factor XIa PTA | Plasma thromboplastin antecedent
Type:
Enzyme
Mol. Mass.:
70130.58
Organism:
Homo sapiens (Human)
Description:
P03951
Residue:
625
  
Inhibitor
Name:
BDBM285859
Synonyms:
US10081617, Example 7
Type:
Small organic molecule
Emp. Form.:
C26H20Cl2N8O3
Mol. Mass.:
563.395
SMILES:
COC(=O)Nc1ccc(cc1)-c1[nH]c(nc1Cl)C1CCc2cc(c[n+]([O-])c12)-c1cc(Cl)ccc1-n1cnnn1
: