Target
Coagulation factor XI
Ligand
BDBM285881
Substrate
Meas. Tech.
Factor XIa Assay
pH
7.4±n/a
IC50
94.0±n/a nM
Comments
extracted
Citation
 Mertz, EEdmondson, SDSo, SSun, WLiu, WNeelamkavil, SFGao, YHruza, AZang, YAli, AMal, RHe, JKuang, RWu, HOgawa, AKNolting, AF Factor XIa inhibitors US Patent  US10081617 Publication Date 9/25/2018 
Target
Name:
Coagulation factor XI
Synonyms:
Coagulation factor XIa Coagulation factor XIa light chain FA11_HUMAN Factor XIa PTA | Plasma thromboplastin antecedent
Type:
Enzyme
Mol. Mass.:
70130.58
Organism:
Homo sapiens (Human)
Description:
P03951
Residue:
625
  
Inhibitor
Name:
BDBM285881
Synonyms:
US10081617, Example 29 methyl [3-chloro-4-(2-{3- [5-chloro-2-(1H-tetrazol-1- yl)phenyl]-7-hydroxy-1- oxido-6,7-dihydro-5H- cyclopenta[b]pyridin-7-yl}- 1H-imidazol-5- yl)phenyl]carbamate
Type:
Small organic molecule
Emp. Form.:
C26H20Cl2N8O4
Mol. Mass.:
579.394
SMILES:
COC(=O)Nc1ccc(-c2cnc([nH]2)C2(O)CCc3cc(c[n+]([O-])c23)-c2cc(Cl)ccc2-n2cnnn2)c(Cl)c1
: