Target
Coagulation factor XI
Ligand
BDBM285900
Substrate
Meas. Tech.
Factor XIa Assay
pH
7.4±n/a
IC50
0.170±n/a nM
Comments
extracted
Citation
 Mertz, EEdmondson, SDSo, SSun, WLiu, WNeelamkavil, SFGao, YHruza, AZang, YAli, AMal, RHe, JKuang, RWu, HOgawa, AKNolting, AF Factor XIa inhibitors US Patent  US10081617 Publication Date 9/25/2018 
Target
Name:
Coagulation factor XI
Synonyms:
Coagulation factor XIa Coagulation factor XIa light chain FA11_HUMAN Factor XIa PTA | Plasma thromboplastin antecedent
Type:
Enzyme
Mol. Mass.:
70130.58
Organism:
Homo sapiens (Human)
Description:
P03951
Residue:
625
  
Inhibitor
Name:
BDBM285900
Synonyms:
7-(5-(5-carboxythiophen-3-yl)-4-chloro-1H-imidazol-2-yl)-3-(5-chloro-2-(1H-tetrazol-1-yl)phenyl)-7-hydroxy-6,7-dihydro-5H-cyclopenta[b]pyridine-1-oxide US10081617, Example 49
Type:
Small organic molecule
Emp. Form.:
C28H26Cl2N4O6S
Mol. Mass.:
617.5
SMILES:
COC(=O)c1cc(cs1)-c1[nH]c(nc1Cl)C1(O)CCc2cc(c[n+]([O-])c12)-c1cc(Cl)ccc1NC(=O)OC(C)(C)C
: