Target
Coagulation factor XI
Ligand
BDBM285938
Substrate
Meas. Tech.
Factor XIa Assay
pH
7.4±n/a
IC50
0.800±n/a nM
Comments
extracted
Citation
 Mertz, EEdmondson, SDSo, SSun, WLiu, WNeelamkavil, SFGao, YHruza, AZang, YAli, AMal, RHe, JKuang, RWu, HOgawa, AKNolting, AF Factor XIa inhibitors US Patent  US10081617 Publication Date 9/25/2018 
Target
Name:
Coagulation factor XI
Synonyms:
Coagulation factor XIa Coagulation factor XIa light chain FA11_HUMAN Factor XIa PTA | Plasma thromboplastin antecedent
Type:
Enzyme
Mol. Mass.:
70130.58
Organism:
Homo sapiens (Human)
Description:
P03951
Residue:
625
  
Inhibitor
Name:
BDBM285938
Synonyms:
US10081617, Example 85 methyl (4-{2-[3-(5-chloro-2- cyanophenyl)-7-hydroxy-4- methoxy-1-oxido-6,7-dihydro- 5H-cyclopenta[b]pyridin-7-yl]- 1H-imidazol-4- yl}phenyl)carbamate
Type:
Small organic molecule
Emp. Form.:
C27H22ClN5O5
Mol. Mass.:
531.947
SMILES:
COC(=O)Nc1ccc(cc1)-c1c[nH]c(n1)C1(O)CCc2c1[n+]([O-])cc(c2OC)-c1cc(Cl)ccc1C#N
: