Target
Coagulation factor XI
Ligand
BDBM285973
Substrate
Meas. Tech.
Factor XIa Assay
pH
7.4±n/a
IC50
0.207±n/a nM
Comments
extracted
Citation
 Mertz, EEdmondson, SDSo, SSun, WLiu, WNeelamkavil, SFGao, YHruza, AZang, YAli, AMal, RHe, JKuang, RWu, HOgawa, AKNolting, AF Factor XIa inhibitors US Patent  US10081617 Publication Date 9/25/2018 
Target
Name:
Coagulation factor XI
Synonyms:
Coagulation factor XIa Coagulation factor XIa light chain FA11_HUMAN Factor XIa PTA | Plasma thromboplastin antecedent
Type:
Enzyme
Mol. Mass.:
70130.58
Organism:
Homo sapiens (Human)
Description:
P03951
Residue:
625
  
Inhibitor
Name:
BDBM285973
Synonyms:
(7S)-7-[5-(4-aminophenyl)-4- chloro-1H-imidazol-2-yl]-3-[5- chloro-2-(1H-tetrazol-1- yl)phenyl]-6,7-dihydro-5H- cyclopenta[b]pyridin-7-ol 1- oxide | US10081617, Example 120
Type:
Small organic molecule
Emp. Form.:
C24H18Cl2N8O2
Mol. Mass.:
521.358
SMILES:
Nc1ccc(cc1)-c1[nH]c(nc1Cl)[C@]1(O)CCc2cc(c[n+]([O-])c12)-c1cc(Cl)ccc1-n1cnnn1
: