Target
Dipeptidyl peptidase 4
Ligand
BDBM50050525
Substrate
Meas. Tech.
Inhibition Assay
pH
8±0
IC50
35000±0 nM
Citation
 Bachovchin, WWLai, HWu, W Soft protease inhibitors and pro-soft forms thereof US Patent  US8933056 Publication Date 1/13/2015 
Target
Name:
Dipeptidyl peptidase 4
Synonyms:
ADABP Adenosine deaminase complexing protein 2 CD_antigen=CD26 DPP4 DPPIV Dipeptidyl peptidase 4 (DPP IV) Dipeptidyl peptidase 4 (DPP4) Dipeptidyl peptidase 4 membrane form Dipeptidyl peptidase IV Dipeptidyl peptidase IV (DDP-IV) Dipeptidyl peptidase IV membrane form Dipeptidyl peptidase-IV (DPP-4) T-cell activation antigen CD26 | TP103
Type:
Enzyme
Mol. Mass.:
88271.01
Organism:
Homo sapiens (Human)
Description:
P27487
Residue:
766
  
Inhibitor
Name:
BDBM50050525
Synonyms:
(R)-1-((S)-2-aminopropanoyl)pyrrolidin-2-ylboronic acid CHEMBL63860 US11559537, Compound 1129 US8933056, Asp-boroPro
Type:
Small organic molecule
Emp. Form.:
C7H15BN2O3
Mol. Mass.:
186.017
SMILES:
C[C@H](N)C(=O)N1CCC[C@H]1B(O)O
: