Target
Melanin-concentrating hormone receptor 1
Ligand
BDBM142155
Substrate
Meas. Tech.
Binding Assay
pH
7±n/a
IC50
26±n/a nM
Comments
extracted
Citation
 Oost, TLotz, RStenkamp, D Pyridone and pyridazinone derivatives as anti-obesity agents US Patent  US8933079 Publication Date 1/13/2015 
Target
Name:
Melanin-concentrating hormone receptor 1
Synonyms:
G-protein coupled receptor 24 MCH receptor 1 MCH-R1 MCHR-1 MCHR1_HUMAN Melanin-Concentrating Hormone Receptor 1 (MCH1R) Melanin-concentrating hormone receptor 1 (MCH-1) Melanin-concentrating hormone receptor 1 (MCHR-1) SLC-1 Somatostatin receptor-like protein
Type:
G Protein-Coupled Receptor (GPCR)
Mol. Mass.:
45976.27
Organism:
Homo sapiens (Human)
Description:
Membranes from CHO-K1 cells stably expressing human MCH1R were used in assays.
Residue:
422
  
Inhibitor
Name:
BDBM142155
Synonyms:
US8933079, 3.8
Type:
Small organic molecule
Emp. Form.:
C25H26ClN3O3
Mol. Mass.:
451.945
SMILES:
Cc1cc(CN2CCCC2)ccc1C(=O)Cn1ccc(OCc2ccc(Cl)cn2)cc1=O
: