Target
Melanin-concentrating hormone receptor 1
Ligand
BDBM142179
Substrate
Meas. Tech.
Binding Assay
pH
7±n/a
IC50
19±n/a nM
Comments
extracted
Citation
 Oost, TLotz, RStenkamp, D Pyridone and pyridazinone derivatives as anti-obesity agents US Patent  US8933079 Publication Date 1/13/2015 
Target
Name:
Melanin-concentrating hormone receptor 1
Synonyms:
G-protein coupled receptor 24 MCH receptor 1 MCH-R1 MCHR-1 MCHR1_HUMAN Melanin-Concentrating Hormone Receptor 1 (MCH1R) Melanin-concentrating hormone receptor 1 (MCH-1) Melanin-concentrating hormone receptor 1 (MCHR-1) SLC-1 Somatostatin receptor-like protein
Type:
G Protein-Coupled Receptor (GPCR)
Mol. Mass.:
45976.27
Organism:
Homo sapiens (Human)
Description:
Membranes from CHO-K1 cells stably expressing human MCH1R were used in assays.
Residue:
422
  
Inhibitor
Name:
BDBM142179
Synonyms:
US8933079, 4.18
Type:
Small organic molecule
Emp. Form.:
C24H26BrN3O3
Mol. Mass.:
484.386
SMILES:
CCN(C)Cc1ccc(C(=O)Cn2ccc(OCc3ccc(Br)cn3)cc2=O)c(C)c1
: