Target
Fibroblast growth factor 2
Ligand
BDBM142255
Substrate
Meas. Tech.
ADP-Glo Kinase Assay
Temperature
298.15±n/a K
IC50
5.1±n/a nM
Comments
extracted
Citation
 Funasaka, SOkada, TTanaka, KNagao, SOhashi, IYamane, YNakatani, YKaroji, Y Monocyclic pyridine derivative US Patent  US8933099 Publication Date 1/13/2015 
Target
Name:
Fibroblast growth factor 2
Synonyms:
Basic fibroblast growth factor FGF2 FGFB Fibroblast growth factor receptor 2 (FGF-2) Heparin-binding growth factor 2
Type:
Protein
Mol. Mass.:
30803.89
Organism:
Homo sapiens (Human)
Description:
P09038
Residue:
288
  
Inhibitor
Name:
BDBM142255
Synonyms:
US8933099, 21
Type:
Small organic molecule
Emp. Form.:
C31H35N5O5
Mol. Mass.:
557.6401
SMILES:
CNC(=O)n1ccc2cc(Oc3ccnc(NC(=O)c4ccc(cc4)C4CCN(C)CC4)c3)c(OCCOC)cc12
: