Target
Beta-secretase 1
Ligand
BDBM142369
Substrate
Meas. Tech.
Cell-Free Assay
IC50
5100±n/a nM
Citation
 Brodney, MAButler, CRHelal, CJO'Neill, BT Hexahydropyrano[3,4-d][1,3]thiazin-2-amine compounds US Patent  US8933221 Publication Date 1/13/2015 
Target
Name:
Beta-secretase 1
Synonyms:
ASP2 Aspartyl protease 2 BACE1 Beta-secretase (BACE) Beta-secretase 1 (BACE 1) Beta-secretase 1 (BACE1) Beta-site amyloid precursor protein cleaving enzyme 1 Memapsin-2 beta-Secretase (BACE-1) | beta-Secretase (BACE1)
Type:
Protein
Mol. Mass.:
55755.10
Organism:
Homo sapiens (Human)
Description:
P56817
Residue:
501
  
Inhibitor
Name:
BDBM142369
Synonyms:
US8933221, 10
Type:
Small organic molecule
Emp. Form.:
C13H14F2N2OS
Mol. Mass.:
284.325
SMILES:
NC1=N[C@]2(COCC[C@H]2CS1)c1ccc(F)cc1F
: