Target
Mitogen-activated protein kinase 12
Ligand
BDBM142621
Substrate
Meas. Tech.
Fluorescence Resonance Energy Transfer (FRET) Assay
IC50
495±n/a nM
Citation
 Murray, PJOnions, STWilliams, JGJoly, K Respiratory formulations and compounds for use therein US Patent  US8933228 Publication Date 1/13/2015 
Target
Name:
Mitogen-activated protein kinase 12
Synonyms:
ERK6 MAPK12 Mitogen-activated protein kinase 12 (MAPK12 p38 gamma) Mitogen-activated protein kinase 12 Gamma SAPK3 | p38 delta/gamma
Type:
Protein
Mol. Mass.:
41938.69
Organism:
Homo sapiens (Human)
Description:
P53778
Residue:
367
  
Inhibitor
Name:
BDBM142621
Synonyms:
US8933228, 12
Type:
Small organic molecule
Emp. Form.:
C34H35N7O4
Mol. Mass.:
605.6862
SMILES:
COc1ccc(cc1)-n1nc(cc1NC(=O)Nc1ccc(Oc2ccnc3[nH]c(=O)n(C(C)C)c23)c2ccccc12)C(C)(C)C
: