Target
Mitogen-activated protein kinase 12
Ligand
BDBM142628
Substrate
Meas. Tech.
Fluorescence Resonance Energy Transfer (FRET) Assay
IC50
44±n/a nM
Citation
 Murray, PJOnions, STWilliams, JGJoly, K Respiratory formulations and compounds for use therein US Patent  US8933228 Publication Date 1/13/2015 
Target
Name:
Mitogen-activated protein kinase 12
Synonyms:
ERK6 MAPK12 Mitogen-activated protein kinase 12 (MAPK12 p38 gamma) Mitogen-activated protein kinase 12 Gamma SAPK3 | p38 delta/gamma
Type:
Protein
Mol. Mass.:
41938.69
Organism:
Homo sapiens (Human)
Description:
P53778
Residue:
367
  
Inhibitor
Name:
BDBM142628
Synonyms:
US8933228, 20
Type:
Small organic molecule
Emp. Form.:
C31H28N8O4
Mol. Mass.:
576.6052
SMILES:
CC(C)(C)c1cc(NC(=O)Nc2ccc(Oc3ccnc4[nH]c(=O)cnc34)c3ccccc23)n(n1)-c1ccc(CO)nc1
: