Target
Mitogen-activated protein kinase 12
Ligand
BDBM142629
Substrate
Meas. Tech.
Fluorescence Resonance Energy Transfer (FRET) Assay
IC50
41±n/a nM
Citation
 Murray, PJOnions, STWilliams, JGJoly, K Respiratory formulations and compounds for use therein US Patent  US8933228 Publication Date 1/13/2015 
Target
Name:
Mitogen-activated protein kinase 12
Synonyms:
ERK6 MAPK12 Mitogen-activated protein kinase 12 (MAPK12 p38 gamma) Mitogen-activated protein kinase 12 Gamma SAPK3 | p38 delta/gamma
Type:
Protein
Mol. Mass.:
41938.69
Organism:
Homo sapiens (Human)
Description:
P53778
Residue:
367
  
Inhibitor
Name:
BDBM142629
Synonyms:
US8933228, 21
Type:
Small organic molecule
Emp. Form.:
C30H27N7O3S
Mol. Mass.:
565.645
SMILES:
Cc1ccc(s1)-n1nc(cc1NC(=O)Nc1ccc(Oc2ccnc3[nH]c(=O)cnc23)c2ccccc12)C(C)(C)C
: