Target
Tyrosine-protein kinase HCK
Ligand
BDBM142621
Substrate
Meas. Tech.
Fluorescence Resonance Energy Transfer (FRET) Assay
IC50
8±n/a nM
Citation
 Murray, PJOnions, STWilliams, JGJoly, K Respiratory formulations and compounds for use therein US Patent  US8933228 Publication Date 1/13/2015 
Target
Name:
Tyrosine-protein kinase HCK
Synonyms:
HCK Hematopoietic cell kinase p59-HCK/p60-HCK p61Hck
Type:
Enzyme Catalytic Domain
Mol. Mass.:
59600.18
Organism:
Homo sapiens (Human)
Description:
P08631
Residue:
526
  
Inhibitor
Name:
BDBM142621
Synonyms:
US8933228, 12
Type:
Small organic molecule
Emp. Form.:
C34H35N7O4
Mol. Mass.:
605.6862
SMILES:
COc1ccc(cc1)-n1nc(cc1NC(=O)Nc1ccc(Oc2ccnc3[nH]c(=O)n(C(C)C)c23)c2ccccc12)C(C)(C)C
: