Target
Tyrosine-protein kinase HCK
Ligand
BDBM142614
Substrate
Meas. Tech.
Fluorescence Resonance Energy Transfer (FRET) Assay
IC50
4±n/a nM
Citation
 Murray, PJOnions, STWilliams, JGJoly, K Respiratory formulations and compounds for use therein US Patent  US8933228 Publication Date 1/13/2015 
Target
Name:
Tyrosine-protein kinase HCK
Synonyms:
HCK Hematopoietic cell kinase p59-HCK/p60-HCK p61Hck
Type:
Enzyme Catalytic Domain
Mol. Mass.:
59600.18
Organism:
Homo sapiens (Human)
Description:
P08631
Residue:
526
  
Inhibitor
Name:
BDBM142614
Synonyms:
US8933228, 30
Type:
Small organic molecule
Emp. Form.:
C31H27N7O3
Mol. Mass.:
545.5912
SMILES:
CC(C)c1cc(NC(=O)Nc2ccc(Oc3ccnc4[nH]c(=O)cnc34)c3ccccc23)n(n1)-c1ccc(C)cc1
: