Target
Mitogen-activated protein kinase 14
Ligand
BDBM142658
Substrate
Meas. Tech.
Cell-Free Kinase Assay
IC50
>31600±n/a nM
Citation
 Seipelt, IClaus, EGuenther, ESchuster, TCzech, MPolymeropoulos, E Pyridopyrazine derivatives and their use US Patent  US8937068 Publication Date 1/20/2015 
Target
Name:
Mitogen-activated protein kinase 14
Synonyms:
CSAID-binding protein CSBP1 CSPB1 MAP kinase 14 MAP kinase p38 alpha MAPK14 MK14_HUMAN Mitogen-activated protein kinase p38 alpha Stress-activated protein kinase 2a | p38 MAP kinase alpha/beta
Type:
Serine/threonine-protein kinase
Mol. Mass.:
41286.76
Organism:
Homo sapiens (Human)
Description:
Q16539
Residue:
360
  
Inhibitor
Name:
BDBM142658
Synonyms:
US8937068, 82
Type:
Small organic molecule
Emp. Form.:
C16H16N6O
Mol. Mass.:
308.3378
SMILES:
CCNC(=O)Nc1ccc2ncc(nc2n1)-c1ccc(N)cc1
: