Target
Mitogen-activated protein kinase 8/9
Ligand
BDBM142667
Substrate
Meas. Tech.
Cell-Free Kinase Assay
IC50
2800±n/a nM
Citation
 Seipelt, IClaus, EGuenther, ESchuster, TCzech, MPolymeropoulos, E Pyridopyrazine derivatives and their use US Patent  US8937068 Publication Date 1/20/2015 
Target
Name:
Mitogen-activated protein kinase 8/9
Synonyms:
Jnk1 & Jnk2
Type:
Mol. Mass.:
Description:
Components:
This complex has 2 components.
Component 1
Name:
Mitogen-activated protein kinase 8
Synonyms:
JNK-46 JNK1-alpha-1 MK08_HUMAN PRKM8 SAPK1C c-Jun N-terminal kinase 1 c-Jun N-terminal kinase 1(JNK1) | c-Jun N-terminal kinase 2 (JNK2)
Type:
Enzyme
Mol. Mass.:
48297.57
Organism:
Homo sapiens (Human)
Description:
JNK-1 was purchased from Upstate Cell Signaling Solutions (formerly Upstate Biotechnology).
Residue:
427
  
Component 2
Name:
Mitogen-activated protein kinase 9
Synonyms:
JNK-55 JNK2/JNK3 MK09_HUMAN Mitogen-activated protein kinase 8/9 SAPK1A c-Jun N-terminal kinase 2 | c-Jun N-terminal kinase 2 (JNK2)
Type:
Enzyme
Mol. Mass.:
48131.49
Organism:
Homo sapiens (Human)
Description:
JNK-2 was purchased from Upstate Cell Signaling Solutions (formerly Upstate Biotechnology).
Residue:
424
  
Inhibitor
Name:
BDBM142667
Synonyms:
US8937068, 154
Type:
Small organic molecule
Emp. Form.:
C17H18N6O2
Mol. Mass.:
338.3638
SMILES:
CCNC(=O)Nc1ccc2ncc(nc2n1)-c1ccc(N)c(OC)c1
: