Target
Kappa-type opioid receptor
Ligand
BDBM142702
Substrate
Meas. Tech.
Radioligand Dose-Displacement Binding Assay
pH
7.4±n/a
Temperature
323.15±n/a K
Ki
0.55±n/a nM
Comments
extracted
Citation
 Park, JHTafesse, L Nitrogen containing morphinan derivatives and the use thereof US Patent  US8937084 Publication Date 1/20/2015 
Target
Name:
Kappa-type opioid receptor
Synonyms:
K-OR-1 Kappa-opioid receptor (KOR) Kappa-type opioid receptor (KOR) OPIATE Kappa OPRK1 kappa opioid receptor (KOR)
Type:
G Protein-Coupled Receptor (GPCR)
Mol. Mass.:
42648.76
Organism:
Homo sapiens (Human)
Description:
P41145
Residue:
380
  
Inhibitor
Name:
BDBM142702
Synonyms:
US8937084, 4
Type:
Small organic molecule
Emp. Form.:
C21H27N3O3
Mol. Mass.:
369.4574
SMILES:
NC(=O)CN1C[C@H]2[C@H]3Cc4ccc(O)cc4[C@@]2(CCN3CC2CC2)CC1=O
: