Target
Bcl-2-related protein A1
Ligand
BDBM142750
Substrate
Meas. Tech.
Fluorescence Polarization Assay
Temperature
298.15±n/a K
IC50
1410±n/a nM
Comments
extracted
Citation
 Pellecchia, MWei, J Apogossypolone derivatives as anticancer agents US Patent  US8937193 Publication Date 1/20/2015 
Target
Name:
Bcl-2-related protein A1
Synonyms:
B2LA1_HUMAN BCL2L5 Bcl-2-like protein 5 HBPA1 Protein BFL-1 | Protein GRS
Type:
Apoptosis regulator protein
Mol. Mass.:
20130.01
Organism:
Homo sapiens (Human)
Description:
Residue:
175
  
Inhibitor
Name:
BDBM142750
Synonyms:
US8937193, 6b
Type:
Small organic molecule
Emp. Form.:
C30H30O8
Mol. Mass.:
518.5544
SMILES:
CC(C)Cc1c(O)c(O)cc2c1c(=O)c(C)c(-c1c(C)c(=O)c3c(CC(C)C)c(O)c(O)cc3c1=O)c2=O
: