Target
Casein kinase II subunit alpha'
Ligand
BDBM142833
Substrate
Meas. Tech.
Kinase Assay
pH
7.4±n/a
Temperature
303.15±n/a K
IC50
0.94±n/a nM
Comments
extracted
Citation
 Purandare, AVFink, BEGavai, AVJohnson, WLHart, ACHe, LHuynh, TNInghrim, JMastalerz, HSang, XTarby, CMWan, HVaccaro, WZhang, GZhao, YZimmermann, K Imidazotriazinecarbonitriles useful as kinase inhibitors US Patent  US8940736 Publication Date 1/27/2015 
Target
Name:
Casein kinase II subunit alpha'
Synonyms:
CK2A2 CSNK2A2 Casein kinase II alpha' Casein kinase II subunit alpha (CSNK2A2)
Type:
Protein
Mol. Mass.:
41223.82
Organism:
Homo sapiens (Human)
Description:
Residue:
350
  
Inhibitor
Name:
BDBM142833
Synonyms:
US8940736, 396
Type:
Small organic molecule
Emp. Form.:
C24H25N11O
Mol. Mass.:
483.5284
SMILES:
CCNc1nc(Nc2ccc3n(nc(C#N)c3c2)C2CCN(CC2)C2COC2)nn2c(cnc12)C#N
: