Target
Microtubule-associated protein tau
Ligand
BDBM142855
Substrate
Meas. Tech.
Inhibition Assay
pH
6.5±n/a
Temperature
298.15±n/a K
IC50
6.7±n/a nM
Comments
extracted
Citation
 Sakai, DNakayama, KWatanabe, K Pyrimidone compounds US Patent  US8940738 Publication Date 1/27/2015 
Target
Name:
Microtubule-associated protein tau
Synonyms:
MAPT TAU_BOVIN | Tau Protein Kinase 1 (TPK1)
Type:
Protein
Mol. Mass.:
46340.02
Organism:
Bos taurus (Bovine)
Description:
P29172
Residue:
448
  
Inhibitor
Name:
BDBM142855
Synonyms:
US8940738, 11
Type:
Small organic molecule
Emp. Form.:
C22H21N7O4
Mol. Mass.:
447.4466
SMILES:
Cc1nc(no1)-c1ccc(cc1)[C@H]1CN(CCO1)c1nc(-c2ccncn2)c(O)c(=O)n1C
: