Target
Coagulation factor XI
Ligand
BDBM286004
Substrate
Meas. Tech.
In Vitro Assay for FXIa
pH
7.4±n/a
Ki
104±n/a nM
Comments
extracted
Citation
 Shi, JEwing, WRNielsen, LHu, ZQuan, ML Diamide macrocycles that are FXIa inhibitors US Patent  US10081623 Publication Date 9/25/2018 
Target
Name:
Coagulation factor XI
Synonyms:
Coagulation factor XIa Coagulation factor XIa light chain FA11_HUMAN Factor XIa PTA | Plasma thromboplastin antecedent
Type:
Enzyme
Mol. Mass.:
70130.58
Organism:
Homo sapiens (Human)
Description:
P03951
Residue:
625
  
Inhibitor
Name:
BDBM286004
Synonyms:
US10081623, Example 17
Type:
Small organic molecule
Emp. Form.:
C27H31ClN8O5
Mol. Mass.:
583.039
SMILES:
COC(=O)Nc1ccc2c(NC(=O)C(C)CCCC[C@H](NC2=O)C(=O)NCCc2cc(Cl)ccc2-n2cnnn2)c1
: