Target
Protein Mdm4
Ligand
BDBM143469
Substrate
Meas. Tech.
Time Resolved Fluorescence Energy Transfer (TR-FRET) Assay
IC50
1126.1±n/a nM
Citation
 Furet, PGuagnano, VHolzer, PMah, RMasuya, KSchlapbach, AStutz, SVaupel, A Pyrazolopyrrolidine compounds US Patent  US8969341 Publication Date 3/3/2015 
Target
Name:
Protein Mdm4
Synonyms:
Double minute 4 protein MDM2-MDMX MDM4_HUMAN Mdm2-like p53-binding protein Protein Mdmx p53-binding protein | p53-binding protein Mdm4
Type:
Oncoprotein
Mol. Mass.:
54842.04
Organism:
Homo sapiens (Human)
Description:
The HDMX(1-188) were expressed in Escherichia coli BL21 (DE3) as a GST fusion and purified on glutathione sepharose.
Residue:
490
  
Inhibitor
Name:
BDBM143469
Synonyms:
US8969341, 110
Type:
Small organic molecule
Emp. Form.:
C28H26Cl2N4O3
Mol. Mass.:
537.437
SMILES:
COc1ccccc1-n1nc2C(=O)N(C(c2c1C(C)C)c1ccc(Cl)cc1C)c1cc(Cl)c(=O)n(C)c1
: