Target
Orexin/Hypocretin receptor type 1
Ligand
BDBM143746
Substrate
Meas. Tech.
Radioligand Binding Assay
Temperature
277.15±n/a K
Ki
11±n/a nM
Comments
extracted
Citation
 Gelin, CFLebold, TPShireman, BT Substituted 2-azabicycles and their use as orexin receptor modulators US Patent  US8969352 Publication Date 3/3/2015 
Target
Name:
Orexin/Hypocretin receptor type 1
Synonyms:
HCRTR1 OX1R_HUMAN Orexin receptor type 1 (OR 1) Orexin receptor type 1 (OX1) Orexin receptor type 1 (OxR1) | Ox1r
Type:
Protein
Mol. Mass.:
47554.50
Organism:
Homo sapiens (Human)
Description:
O43613
Residue:
425
  
Inhibitor
Name:
BDBM143746
Synonyms:
US10183953, Example 36 US8969352, 7 US9845333, 36
Type:
Small organic molecule
Emp. Form.:
C21H18F3N5O2
Mol. Mass.:
429.3951
SMILES:
FC(F)(F)c1ccc(OC2CC3CC2N(C3)C(=O)c2ccccc2-n2nccn2)nc1
: