Target
Orexin receptor type 2
Ligand
BDBM143769
Substrate
Meas. Tech.
Radioligand Binding Assay
Ki
1700±n/a nM
Citation
 Gelin, CFLebold, TPShireman, BT Substituted 2-azabicycles and their use as orexin receptor modulators US Patent  US8969352 Publication Date 3/3/2015 
Target
Name:
Orexin receptor type 2
Synonyms:
HCRTR2 OX2R_HUMAN Orexin receptor type 2 (OR-2) Orexin receptor type 2 (OX2R) Ox-2-R | Ox2-R
Type:
Protein
Mol. Mass.:
50710.53
Organism:
Homo sapiens (Human)
Description:
O43614
Residue:
444
  
Inhibitor
Name:
BDBM143769
Synonyms:
US10183953, Example 30 US9611277, Example 30 | US9845333, 30
Type:
Small organic molecule
Emp. Form.:
C20H17F3N6O2
Mol. Mass.:
430.3832
SMILES:
FC(F)(F)c1ccc(OC2CC3CC2N(C3)C(=O)c2ncccc2-n2nccn2)nc1
: