Target
Serine/threonine-protein kinase TBK1
Ligand
BDBM144188
Substrate
Meas. Tech.
Flashplate Assay
pH
7.5±n/a
Temperature
303.15±n/a K
IC50
250±n/a nM
Comments
extracted
Citation
 Hoelzemann, GDorsch, DEggenweiler, H Benzonitrile derivatives as kinase inhibitors US Patent  US8969335 Publication Date 3/3/2015 
Target
Name:
Serine/threonine-protein kinase TBK1
Synonyms:
NAK Protein cereblon/Serine/threonine-protein kinase TBK1 TANK-binding kinase 1 (TBK-1) TBK1 | TBK1_HUMAN
Type:
protein
Mol. Mass.:
83645.20
Organism:
Homo sapiens (Human)
Description:
Q9UHD2
Residue:
729
  
Inhibitor
Name:
BDBM144188
Synonyms:
US8969335, A11
Type:
Small organic molecule
Emp. Form.:
C23H19N5O2
Mol. Mass.:
397.4293
SMILES:
N#Cc1ccc(Nc2cc(ccn2)-c2ccc(OC3CCOCC3)c(c2)C#N)nc1
: