Target
Inhibitor of nuclear factor kappa-B kinase subunit epsilon
Ligand
BDBM144215
Substrate
Meas. Tech.
Flashplate Assay
pH
7.5±n/a
Temperature
303.15±n/a K
IC50
5±n/a nM
Comments
extracted
Citation
 Hoelzemann, GDorsch, DEggenweiler, H Benzonitrile derivatives as kinase inhibitors US Patent  US8969335 Publication Date 3/3/2015 
Target
Name:
Inhibitor of nuclear factor kappa-B kinase subunit epsilon
Synonyms:
I kappa-B kinase epsilon I-kappa-B kinase epsilon (IKK-E) IKBKE IKK-epsilon IKKE IKKI KIAA0151 | von Hippel-Lindau disease tumor suppressor/Inhibitor of nuclear factor kappa-B kinase subunit epsilon
Type:
Serine/threonine-protein kinase
Mol. Mass.:
80475.98
Organism:
Homo sapiens (Human)
Description:
Kinase inhibitory activity was determined using recombinant human IKK-epsilon expressed in baculovirus as a FLAG-tagged fusion protein.
Residue:
716
  
Inhibitor
Name:
BDBM144215
Synonyms:
US8969335, A40
Type:
Small organic molecule
Emp. Form.:
C23H25N7O2
Mol. Mass.:
431.4903
SMILES:
N#Cc1cc(ccc1OC1CCOCC1)-c1ccnc(Nc2cnn(c2)C2CCNC2)n1
: