Target
Prostaglandin E synthase
Ligand
BDBM286067
Substrate
Meas. Tech.
mPGES1 enzyme assay
IC50
7.74±n/a nM
Citation
 Li, XHe, WLiu, XWang, BHu, QJin, FDong, QSun, P Amide derivatives and pharmaceutically acceptable salts thereof, preparation method thereof and medicinal application thereof US Patent  US10081629 Publication Date 9/25/2018 
Target
Name:
Prostaglandin E synthase
Synonyms:
MGST1L1 PGES PTGES Prostaglandin E synthase (PGES-1) Prostaglandin E synthase-1 (PGES-1) Prostaglandin E2 synthase-1 ( mPGES-1)
Type:
Protein
Mol. Mass.:
17112.22
Organism:
Homo sapiens (Human)
Description:
Residue:
152
  
Inhibitor
Name:
BDBM286067
Synonyms:
2-(Difluoromethyl)-5-(((2-fluoro-2-methyl-propanoyl)amino)methyl)-N-(2-(3-(trifluoromethyl)phenyl)benzo[d]oxazol-5-yl)nicotinamide | US10081629, Example 56
Type:
Small organic molecule
Emp. Form.:
C26H20F6N4O3
Mol. Mass.:
550.4524
SMILES:
CC(C)(F)C(=O)NCc1cnc(C(F)F)c(c1)C(=O)Nc1ccc2oc(nc2c1)-c1cccc(c1)C(F)(F)F
: