Target
Prostaglandin E synthase
Ligand
BDBM286072
Substrate
Meas. Tech.
mPGES1 enzyme assay
IC50
68.1±n/a nM
Citation
 Li, XHe, WLiu, XWang, BHu, QJin, FDong, QSun, P Amide derivatives and pharmaceutically acceptable salts thereof, preparation method thereof and medicinal application thereof US Patent  US10081629 Publication Date 9/25/2018 
Target
Name:
Prostaglandin E synthase
Synonyms:
MGST1L1 PGES PTGES Prostaglandin E synthase (PGES-1) Prostaglandin E synthase-1 (PGES-1) Prostaglandin E2 synthase-1 ( mPGES-1)
Type:
Protein
Mol. Mass.:
17112.22
Organism:
Homo sapiens (Human)
Description:
Residue:
152
  
Inhibitor
Name:
BDBM286072
Synonyms:
2-Bromo-N-(1-ethyl-3-(4-fluorophenyl)-1Hindol-5-yl)5-((2,2-dimethylpropanoylamino)methyl)-benzamide | US10081629, Example 6
Type:
Small organic molecule
Emp. Form.:
C29H29BrFN3O2
Mol. Mass.:
550.462
SMILES:
CCn1cc(-c2ccc(F)cc2)c2cc(NC(=O)c3cc(CNC(=O)C(C)(C)C)ccc3Br)ccc12
: