Target
Gamma-aminobutyric acid receptor subunit alpha-2
Ligand
BDBM144224
Substrate
Meas. Tech.
Radioligand Competition Binding Assay
Ki
31.1±n/a nM
Citation
 Omoto, KOwen, RMPryde, DCWatson, CATakeuchi, M Chemical compounds US Patent  US8952008 Publication Date 2/10/2015 
Target
Name:
Gamma-aminobutyric acid receptor subunit alpha-2
Synonyms:
GABA receptor alpha-2 subunit GBRA2_HUMAN | Gamma-aminobutyric acid receptor subunit alpha-2 (GABRA2)
Type:
Protein
Mol. Mass.:
51338.78
Organism:
Homo sapiens (Human)
Description:
P47869
Residue:
451
  
Inhibitor
Name:
BDBM144224
Synonyms:
US8952008, 1
Type:
Small organic molecule
Emp. Form.:
C22H21FN4O2S
Mol. Mass.:
424.491
SMILES:
CCn1cnc2c(cnnc12)-c1ccc(F)c(c1)-c1ccc(cc1)S(=O)(=O)C(C)C
: