Target
Tyrosine-protein kinase receptor
Ligand
BDBM144281
Substrate
Meas. Tech.
Inhibition Assay
IC50
0.99±n/a nM
Citation
 Shimada, IKurosawa, KMatsuya, TIikubo, KKondoh, YKamikawa, ATomiyama, HIwai, Y Diamino heterocyclic carboxamide compound US Patent  US8969336 Publication Date 3/3/2015 
Target
Name:
Tyrosine-protein kinase receptor
Synonyms:
EML4 ALK Fusion Protein
Type:
Protein
Mol. Mass.:
87656.33
Organism:
Homo sapiens (Human)
Description:
A9YLN7
Residue:
796
  
Inhibitor
Name:
BDBM144281
Synonyms:
US8969336, 110
Type:
Small organic molecule
Emp. Form.:
C21H29N5O4S
Mol. Mass.:
447.551
SMILES:
CCc1nc(C(N)=O)c(Nc2cccc(c2)S(C)(=O)=O)nc1N[C@H]1CC[C@](C)(O)CC1
: