Target
Tyrosine-protein kinase receptor
Ligand
BDBM144303
Substrate
Meas. Tech.
Inhibition Assay
IC50
0.26±n/a nM
Citation
 Shimada, IKurosawa, KMatsuya, TIikubo, KKondoh, YKamikawa, ATomiyama, HIwai, Y Diamino heterocyclic carboxamide compound US Patent  US8969336 Publication Date 3/3/2015 
Target
Name:
Tyrosine-protein kinase receptor
Synonyms:
EML4 ALK Fusion Protein
Type:
Protein
Mol. Mass.:
87656.33
Organism:
Homo sapiens (Human)
Description:
A9YLN7
Residue:
796
  
Inhibitor
Name:
BDBM144303
Synonyms:
US8969336, 459
Type:
Small organic molecule
Emp. Form.:
C31H48N8O3
Mol. Mass.:
580.7646
SMILES:
CCOc1cc(Nc2nc(N[C@H]3CC[C@H](O)CC3)c(CC)nc2C(N)=O)ccc1N1CCC(CC1)N1CCN(C)CC1
: