Target
Tyrosine-protein kinase receptor
Ligand
BDBM144306
Substrate
Meas. Tech.
Inhibition Assay
IC50
2.8±n/a nM
Citation
 Shimada, IKurosawa, KMatsuya, TIikubo, KKondoh, YKamikawa, ATomiyama, HIwai, Y Diamino heterocyclic carboxamide compound US Patent  US8969336 Publication Date 3/3/2015 
Target
Name:
Tyrosine-protein kinase receptor
Synonyms:
EML4 ALK Fusion Protein
Type:
Protein
Mol. Mass.:
87656.33
Organism:
Homo sapiens (Human)
Description:
A9YLN7
Residue:
796
  
Inhibitor
Name:
BDBM144306
Synonyms:
US8969336, 491
Type:
Small organic molecule
Emp. Form.:
C32H50N8O2
Mol. Mass.:
578.7918
SMILES:
CCc1nc(C(N)=O)c(Nc2ccc(N3CCC(CC3)N3CCN(C)CC3)c(C)c2)nc1NC1CCC(O)(CC)CC1
: