Target
Tyrosine-protein kinase receptor
Ligand
BDBM144313
Substrate
Meas. Tech.
Inhibition Assay
IC50
11±n/a nM
Citation
 Shimada, IKurosawa, KMatsuya, TIikubo, KKondoh, YKamikawa, ATomiyama, HIwai, Y Diamino heterocyclic carboxamide compound US Patent  US8969336 Publication Date 3/3/2015 
Target
Name:
Tyrosine-protein kinase receptor
Synonyms:
EML4 ALK Fusion Protein
Type:
Protein
Mol. Mass.:
87656.33
Organism:
Homo sapiens (Human)
Description:
A9YLN7
Residue:
796
  
Inhibitor
Name:
BDBM144313
Synonyms:
US8969336, 545
Type:
Small organic molecule
Emp. Form.:
C23H33N7O2
Mol. Mass.:
439.5538
SMILES:
CCc1nc(C(N)=O)c(Nc2ccc(cc2)N2CCN(C)CC2)nc1NC1CCOCC1
: