Target
Proto-oncogene tyrosine-protein kinase receptor Ret
Ligand
BDBM144327
Substrate
Meas. Tech.
Inhibition Assay
IC50
1.1±n/a nM
Citation
 Shimada, IKurosawa, KMatsuya, TIikubo, KKondoh, YKamikawa, ATomiyama, HIwai, Y Diamino heterocyclic carboxamide compound US Patent  US8969336 Publication Date 3/3/2015 
Target
Name:
Proto-oncogene tyrosine-protein kinase receptor Ret
Synonyms:
CDHF12 Cadherin family member 12 Proto-oncogene c-Ret RET51 Tyrosine-protein kinase Ret (RET)
Type:
Protein
Mol. Mass.:
124318.29
Organism:
Homo sapiens (Human)
Description:
P07949
Residue:
1114
  
Inhibitor
Name:
BDBM144327
Synonyms:
US8969336, 571
Type:
Small organic molecule
Emp. Form.:
C31H48N8O2
Mol. Mass.:
564.7652
SMILES:
CCc1nc(C(N)=O)c(Nc2ccc(N3CCC(CC3)N3CCN(C)CC3)c(C)c2)nc1N[C@H]1CC[C@@](C)(O)CC1
: