Target
Chymase
Ligand
BDBM144340
Substrate
Meas. Tech.
In Vitro Assay
pH
8±n/a
IC50
50±n/a nM
Comments
extracted
Citation
 Abeywardane, AHao, MTaylor, SJ Chymase inhibitors US Patent  US8969348 Publication Date 3/3/2015 
Target
Name:
Chymase
Synonyms:
Alpha-chymase CMA1_HUMAN CYM Mast cell protease I
Type:
Enzyme
Mol. Mass.:
27340.12
Organism:
Homo sapiens (Human)
Description:
Residue:
247
  
Inhibitor
Name:
BDBM144340
Synonyms:
US8969348, {4-[(1,4-Dimethyl-1H-indol-3-yl)methyl]-1-oxophthalazin-2(1H)-yl}acetic acid
Type:
Small organic molecule
Emp. Form.:
C21H19N3O3
Mol. Mass.:
361.3939
SMILES:
Cc1cccc2n(C)cc(Cc3nn(CC(O)=O)c(=O)c4ccccc34)c12
: