Target
Phosphodiesterase
Ligand
BDBM144390
Substrate
Meas. Tech.
Inhibition Assay
pH
8±n/a
IC50
0.09±n/a nM
Comments
extracted
Citation
 Kawanishi, EHongu, MTanaka, Y Pyrazolopyrimidine compounds and their use as PDE10 inhibitors US Patent  US8969376 Publication Date 3/3/2015 
Target
Name:
Phosphodiesterase
Synonyms:
Phosphodiesterase 10A (PDE10A)
Type:
Protein
Mol. Mass.:
81617.01
Organism:
Bos taurus (Bovine)
Description:
F1MPW5
Residue:
711
  
Inhibitor
Name:
BDBM144390
Synonyms:
US8969376, 1.006
Type:
Small organic molecule
Emp. Form.:
C23H25F2N7O
Mol. Mass.:
453.4877
SMILES:
Cc1nc2ccc(F)cc2nc1-c1cc2nc(cc(NCC(C)(C)O)n2n1)N1CC[C@@H](F)C1
: