Target
Phosphodiesterase
Ligand
BDBM144404
Substrate
Meas. Tech.
Inhibition Assay
pH
8±n/a
IC50
0.18±n/a nM
Comments
extracted
Citation
 Kawanishi, EHongu, MTanaka, Y Pyrazolopyrimidine compounds and their use as PDE10 inhibitors US Patent  US8969376 Publication Date 3/3/2015 
Target
Name:
Phosphodiesterase
Synonyms:
Phosphodiesterase 10A (PDE10A)
Type:
Protein
Mol. Mass.:
81617.01
Organism:
Bos taurus (Bovine)
Description:
F1MPW5
Residue:
711
  
Inhibitor
Name:
BDBM144404
Synonyms:
US8969376, 1.085
Type:
Small organic molecule
Emp. Form.:
C26H27F4N7O
Mol. Mass.:
529.5325
SMILES:
C[C@]1(O)CC[C@@H](CC1)Nc1cc(nc2cc(nn12)-c1nc2ccccc2nc1C(F)(F)F)N1CC[C@@H](F)C1
: