Target
Phosphodiesterase
Ligand
BDBM144405
Substrate
Meas. Tech.
Inhibition Assay
pH
8±n/a
IC50
0.035±n/a nM
Comments
extracted
Citation
 Kawanishi, EHongu, MTanaka, Y Pyrazolopyrimidine compounds and their use as PDE10 inhibitors US Patent  US8969376 Publication Date 3/3/2015 
Target
Name:
Phosphodiesterase
Synonyms:
Phosphodiesterase 10A (PDE10A)
Type:
Protein
Mol. Mass.:
81617.01
Organism:
Bos taurus (Bovine)
Description:
F1MPW5
Residue:
711
  
Inhibitor
Name:
BDBM144405
Synonyms:
US8969376, 1.097
Type:
Small organic molecule
Emp. Form.:
C25H28FN7O
Mol. Mass.:
461.5345
SMILES:
Cc1nc2ccc(F)cc2nc1-c1cc2nc(cc(N[C@H]3CCCC[C@@H]3O)n2n1)N1CCCC1
: